Warning: get_headers(): SSL operation failed with code 1. OpenSSL Error messages: error:14090086:SSL routines:ssl3_get_server_certificate:certificate verify failed in /mnt/data/vhosts/casite-460905.cloudaccess.net/httpdocs/components/com_community/libraries/user.php on line 845

Warning: get_headers(): Failed to enable crypto in /mnt/data/vhosts/casite-460905.cloudaccess.net/httpdocs/components/com_community/libraries/user.php on line 845

Warning: get_headers(https://www.gravatar.com/avatar/d41d8cd98f00b204e9800998ecf8427e?s=200&d=404): failed to open stream: operation failed in /mnt/data/vhosts/casite-460905.cloudaccess.net/httpdocs/components/com_community/libraries/user.php on line 845
Teseo replied to the topic 'Error build source' in the forum. 1 month ago

Ok, just add -DBUILD_TESTING=OFF in cmake script command and not build tests.
Thanks at all for info.

In this period I don't have much time to devote to astronomy, I am very busy with my job as an ambulance driver for the Italian Red Cross.
Unfortunately in Italy ( I'm From Pesaro-Urbino province ) we have many problems with the Coronavirus Covid-19.

Bye.

Read More...

Teseo replied to the topic 'Error build source' in the forum. 1 month ago

Hi all. Continue not build:

...
[ 99%] Building CXX object Tests/kstars_ui/CMakeFiles/kstars_ui_tests.dir/test_ekos_wizard.cpp.o
CMakeFiles/testfitsdata.dir/testfitsdata.cpp.o: in the function "TestFitsData::testLoadFits()":
/opt/Astronomia/indi_ekos_build/Projects/kstars/Tests/fitsviewer/testfitsdata.cpp:92: undefined reference a "bool QTest::qCompare<double, int>(double const&, int const&, char const*, char const*, char const*, int)"
/opt/Astronomia/indi_ekos_build/Projects/kstars/Tests/fitsviewer/testfitsdata.cpp:93: undefined reference a "bool QTest::qCompare<double, int>(double const&, int const&, char const*, char const*, char const*, int)"
/opt/Astronomia/indi_ekos_build/Projects/kstars/Tests/fitsviewer/testfitsdata.cpp:96: undefined reference a "bool QTest::qCompare<double, int>(double const&, int const&, char const*, char const*, char const*, int)"
collect2: error: ld returned 1 exit status
Tests/fitsviewer/CMakeFiles/testfitsdata.dir/build.make:133: recipe for target 'Tests/fitsviewer/testfitsdata' failed
make[2]: *** [Tests/fitsviewer/testfitsdata] Error 1
CMakeFiles/Makefile2:1795: recipe for target 'Tests/fitsviewer/CMakeFiles/testfitsdata.dir/all' failed
make[1]: *** [Tests/fitsviewer/CMakeFiles/testfitsdata.dir/all] Error 2
make[1]: *** Waiting for unfinished processes....
[ 99%] Building CXX object Tests/kstars_ui/CMakeFiles/kstars_ui_tests.dir/test_ekos.cpp.o
...


Read More...

Teseo created a new topic ' Erroro build source' in the forum. 2 months ago

Hi.

[ 97%] Built target test_skypoint [ 98%] Built target kstars CMakeFiles/testfitsdata.dir/testfitsdata.cpp.o: in the function "TestFitsData::testLoadFits()": /opt/Astronomia/indi_ekos_build/Projects/kstars/Tests/fitsviewer/testfitsdata.cpp:62: undefined reference a "bool QTest::qCompare<double, int>(double const&, int const&, char const*, char const*, char const*, int)" /opt/Astronomia/indi_ekos_build/Projects/kstars/Tests/fitsviewer/testfitsdata.cpp:63: undefined reference a "bool QTest::qCompare<double, int>(double const&, int const&, char const*, char const*, char const*, int)" /opt/Astronomia/indi_ekos_build/Projects/kstars/Tests/fitsviewer/testfitsdata.cpp:66: undefined reference a "bool QTest::qCompare<double, int>(double const&, int const&, char const*, char const*, char const*, int)" collect2: error: ld returned 1 exit status Tests/fitsviewer/CMakeFiles/testfitsdata.dir/build.make:133: recipe for target 'Tests/fitsviewer/testfitsdata' failed make[2]: *** [Tests/fitsviewer/testfitsdata] Error 1 CMakeFiles/Makefile2:1795: recipe for target 'Tests/fitsviewer/CMakeFiles/testfitsdata.dir/all' failed make[1]: *** [Tests/fitsviewer/CMakeFiles/testfitsdata.dir/all] Error 2 make[1]: *** Waiting for unfinished processes .... [ 99%] Built target kstars_ui_tests Makefile:140: recipe for target 'all' failed make: *** [all] Error 2 [code] Thanks.[code]
[ 97%] Built target test_skypoint
[ 98%] Built target kstars
CMakeFiles/testfitsdata.dir/testfitsdata.cpp.o: in the function "TestFitsData::testLoadFits()":
/opt/Astronomia/indi_ekos_build/Projects/kstars/Tests/fitsviewer/testfitsdata.cpp:62: undefined reference a "bool QTest::qCompare<double, int>(double const&, int const&, char const*, char const*, char const*, int)"
/opt/Astronomia/indi_ekos_build/Projects/kstars/Tests/fitsviewer/testfitsdata.cpp:63: undefined reference a "bool QTest::qCompare<double, int>(double const&, int const&, char const*, char const*, char const*, int)"
/opt/Astronomia/indi_ekos_build/Projects/kstars/Tests/fitsviewer/testfitsdata.cpp:66: undefined reference a "bool QTest::qCompare<double, int>(double const&, int const&, char const*, char const*, char const*, int)"
collect2: error: ld returned 1 exit status
Tests/fitsviewer/CMakeFiles/testfitsdata.dir/build.make:133: recipe for target 'Tests/fitsviewer/testfitsdata' failed
make[2]: *** [Tests/fitsviewer/testfitsdata] Error 1
CMakeFiles/Makefile2:1795: recipe for target 'Tests/fitsviewer/CMakeFiles/testfitsdata.dir/all' failed
make[1]: *** [Tests/fitsviewer/CMakeFiles/testfitsdata.dir/all] Error 2
make[1]: *** Waiting for unfinished processes ....
[ 99%] Built target kstars_ui_tests
Makefile:140: recipe for target 'all' failed
make: *** [all] Error 2
Thanks.[code]

Thanks.

Read More...

Eric thanked Teseo in topic Error build 3 months ago

Teseo created a new topic ' Error build' in the forum. 3 months ago

Hi, last nt build, return this error:

[ 97%] Building CXX object Tests/skyobjects/CMakeFiles/test_skypoint.dir/test_skypoint_autogen/mocs_compilation.cpp.o
libKStarsLib.a(indiproperty.cpp.o): in the function "INDI_P::buildLightGUI()":
/opt/Astronomia/indi_ekos_build/Projects/kstars/kstars/indi/indiproperty.cpp:279:undefined reference a "INDI::Property::getLight() const"
libKStarsLib.a(indistd.cpp.o): in the function "ISD::GenericDevice::getJSONProperty(QString const&, QJsonObject&, bool)":
/opt/Astronomia/indi_ekos_build/Projects/kstars/kstars/indi/indistd.cpp:931: undefined reference a "INDI::Property::getLight() const"
libKStarsLib.a(indidbus.cpp.o): in the function "INDIDBus::getProperties(QString const&)":
/opt/Astronomia/indi_ekos_build/Projects/kstars/kstars/indi/indidbus.cpp:184: undefined reference a "INDI::Property::getLight() const"
libKStarsLib.a(indidbus.cpp.o): in the function "INDIDBus::getLight(QString const&, QString const&, QString const&)":
/opt/Astronomia/indi_ekos_build/Projects/kstars/kstars/indi/indidbus.cpp:305: undefined reference a "INDI::Property::getLight() const"
collect2: error: ld returned 1 exit status
kstars/CMakeFiles/kstars.dir/build.make:227: recipe for target 'kstars/kstars' failed
make[2]: *** [kstars/kstars] Error 1
CMakeFiles/Makefile2:393: recipe for target 'kstars/CMakeFiles/kstars.dir/all' failed
make[1]: *** [kstars/CMakeFiles/kstars.dir/all] Error 2
make[1]: *** Attesa per i processi non terminati....
[ 98%] Linking CXX executable test_skypoint
[ 98%] Built target testfwparser
[ 98%] Built target testcsvparser
[ 98%] Built target test_skypoint
Makefile:140: recipe for target 'all' failed
make: *** [all] Error 2

Thanks.

Read More...

Teseo replied to the topic 'Memory Leak' in the forum. 3 months ago

Very good, work ok.
Thanks knro.

Read More...

Teseo thanked Jasem Mutlaq in topic Memory Leak 3 months ago

Teseo thanked Eric in topic Error compiling 3 months ago

Teseo created a new topic ' Error compiling' in the forum. 3 months ago

For several days kstars has not been compiled,
fails with this error:

[ 99%] Built target kstars
CMakeFiles/kstars_ui_tests.dir/test_ekos.cpp.o: in the function "KStarsUiTests::manipulateEkosProfiles()::{lambda()#3}::operator()() const":
/opt/Astronomia/indi_ekos_build/Projects/kstars/Tests/kstars_ui/test_ekos.cpp:198: undefined reference a "bool QTest::qCompare<QString, char [20]>(QString const&, char const (&) [20], char const*, char const*, char const*, int)"
/opt/Astronomia/indi_ekos_build/Projects/kstars/Tests/kstars_ui/test_ekos.cpp:202: undefined reference a "bool QTest::qCompare<QString, char [14]>(QString const&, char const (&) [14], char const*, char const*, char const*, int)"
collect2: error: ld returned 1 exit status
Tests/kstars_ui/CMakeFiles/kstars_ui_tests.dir/build.make:258: recipe for target 'Tests/kstars_ui/kstars_ui_tests' failed
make[2]: *** [Tests/kstars_ui/kstars_ui_tests] Error 1
CMakeFiles/Makefile2:1407: recipe for target 'Tests/kstars_ui/CMakeFiles/kstars_ui_tests.dir/all' failed
make[1]: *** [Tests/kstars_ui/CMakeFiles/kstars_ui_tests.dir/all] Error 2
Makefile:140: recipe for target 'all' failed
make: *** [all] Error 2
[pcxz@kstars]$ 


Read More...

Teseo replied to the topic 'Celestron hybernation mode' in the forum. 4 months ago

ChrisRowland wrote: The earliest is NS+ HC 5.22 for gems and 5.24 for fork mounts. This is when Celestron implemented the command in their HCs.

Chris


Version 4.22 also has the hibernation function, I use it every night.
No problem, I continue to do it manually.
Bye

Read More...

Teseo replied to the topic 'Celestron hybernation mode' in the forum. 5 months ago

ChrisRowland wrote: I worked with the Celestron developers to arrange a set of RS232 ...
It's for the NexStar Plus HC only...

Chris


Only for Plus version? .. is not possible port also in non Plus version ? ( NexStar 4.22 )
Thanks

Read More...

Teseo replied to the topic 'Memory Leak' in the forum. 5 months ago

hy wrote: I was wondering, for the folks with the memory leak--do you have the option "Single Preview Tab" checked? (I think you should have it checked).
You find that under the KStars options, then FITS, then it's a checkbox on that page.
I believe that KStars/fitsviewer would leak tabs if you had it unchecked (perhaps it should limit the number of tabs, I don't know if it does or doesn't).
Hy


Yes is checked and Fits viewer is disabled.
Thanks

Read More...

Tim Schuh thanked Teseo in topic Memory Leak 5 months ago

Teseo replied to the topic 'Memory Leak' in the forum. 5 months ago

knro wrote: I would like to know how I can replicate this.. I took 500 images on StellarMate a couple of weeks ago and I couldn't detect any memory leak. Was HIPS overlay enabled? I'd like to replicate exact conditions.


Thanks knro, next time I create a log, HIPS is disabled.
I forgot to mention that they are all FITS image ( fits viewer is disabled ).

Read More...

Teseo thanked Jasem Mutlaq in topic Memory Leak 5 months ago