Bryan Bourn replied to the topic 'Remove Sticky Announcement?' in the forum. 2 days ago

Anything would help: Make it smaller, bottom of page, notification indicator - anything. It takes up half of the screen on EVERY refresh!

Read More...

Would be great to see a MacOS 3.5.3 too. Rob's latest build script still doesn't work for me.

Action: compile for kde/frameworks/tier1/kguiaddons:5.77.0 FAILED
*** Craft all failed: kde/frameworks/tier1/kguiaddons after 2 seconds ***
fatal error: package kde/frameworks/tier1/kguiaddons all failed

Read More...

Bryan Bourn replied to the topic 'Post your INDI Setup!' in the forum. 1 week ago
Bryan Bourn replied to the topic 'Current MacOS Build?' in the forum. 3 weeks ago

Now seeing this error trying to build kguiaddons:

-- Could not set up the appstream test. appstreamcli is missing.-- Could NOT find Qt5WaylandClient (missing: Qt5WaylandClient_DIR)CMake Error at /Users/bryan/Development/AstroRoot/craft-root/dev-utils/cmake-base/CMake.app/Contents/share/cmake-3.19/Modules/FindPackageHandleStandardArgs.cmake:218 (message):  Could NOT find QtWaylandScanner (missing: QtWaylandScanner_EXECUTABLE)Call Stack (most recent call first):  /Users/bryan/Development/AstroRoot/craft-root/dev-utils/cmake-base/CMake.app/Contents/share/cmake-3.19/Modules/FindPackageHandleStandardArgs.cmake:577 (_FPHSA_FAILURE_MESSAGE)  /Users/bryan/Development/AstroRoot/craft-root/share/ECM/find-modules/FindQtWaylandScanner.cmake:78 (find_package_handle_standard_args)  CMakeLists.txt:43 (find_package)  -- Configuring incomplete, errors occurred!See also "/Users/bryan/Development/AstroRoot/craft-root/build/kde/frameworks/tier1/kguiaddons/work/build/CMakeFiles/CMakeOutput.log".See also "/Users/bryan/Development/AstroRoot/craft-root/build/kde/frameworks/tier1/kguiaddons/work/build/CMakeFiles/CMakeError.log".Action: compile for kde/frameworks/tier1/kguiaddons:5.77.0 FAILED*** Craft all failed: kde/frameworks/tier1/kguiaddons after 3 seconds ***fatal error: package kde/frameworks/tier1/kguiaddons all failed


Read More...

Bryan Bourn created a new topic ' Remove Sticky Announcement?' in the forum. 3 weeks ago

I know it's just a nit, but is there a preference setting to remove that sticky "INDI Library v1.8.9 Released" announcement from the top of the page?  It's so big that it takes up much of the screen, and it comes back on every refresh - even after clicking the X or marking all announcements as read.  Is there a way to mark it read so I don't see it again, or maybe to choose not to see announcements?

Read More...

Bryan Bourn replied to the topic 'Current MacOS Build?' in the forum. 3 weeks ago

Anyone else trying Rob's new build script with the included Qt? I like the idea much better, but it's not compiling for me on 11.2.3 with XCode 12.4. Something in indiserver is failing:

[123/501] Building CXX object CMakeFiles/indidriverstatic.dir/libs/indibase/thread/indisinglethreadpool.cpp.o
ninja: build stopped: subcommand failed.
Action: compile for libs/indiserver:Latest FAILED
*** Craft all failed: libs/indiserver after 1 minute 30 seconds ***
fatal error: package libs/indiserver all failed
Craft stopped with out completing

~~~~~~~~~~~~~~~~~~~~~~~~~~~~~~~~~~~~~~~~~~~~~~~~~~~~~~
~ Something failed
~~~~~~~~~~~~~~~~~~~~~~~~~~~~~~~~~~~~~~~~~~~~~~~~~~~~~~

Read More...

Bryan Bourn replied to the topic 'Current MacOS Build?' in the forum. 3 weeks ago

Trying to build latest on 11.2.3 MacBook Air.  See this:

 ======================================================================================================================== *** Handling package: python-modules/pip-system, action: all *** *** Action: fetch-binary for python-modules/pip-system *** Could not find python-modules/pip-system=3.5 in https://files.kde.org/craft/master/Qt_5.15.2/macos/64/clang/RelWithDebInfo Could not find python-modules/pip-system=3.5 in https://files.kde.org/craft/master/Qt_5.15.2/macos/64/clang/Release *** python-modules/pip-system not found in cache *** *** Action: fetch for python-modules/pip-system *** % Total % Received % Xferd Average Speed Time Time Time Current Dload Upload Total Spent Left Speed 0 0 0 0 0 0 0 0 --:--:-- --:--:-- --:--:-- 0 curl: (22) The requested URL returned error: 404


Read More...

Ran an imaging session the other night with latest nightly on SM via VNC. Got through lights and darks, but when it came to flats, I forgot to set a decent delay time between images, and Ekos crashed after about the third image. After a restart and setting about a six second delay, it ran the flats sequence.

Seems if Ekos tries to write the very large files created by the 2600 too quickly (short exposures like bias and flats), it crashes.

Read More...

Bryan Bourn replied to the topic 'Current MacOS Build?' in the forum. 1 month ago

Yes, it seems to run fine with Rosetta, but I'm talking about building from code. It fails with many link errors as noted above. I didn't look into script settings or Qt config or any other deep troubleshooting - wanted to know if the consensus thought I should expect it to build on an M1 machine or not? Doesn't look like it.

Read More...

Bryan Bourn replied to the topic 'Current MacOS Build?' in the forum. 1 month ago

Any chance the KStars-INDI-Mac-Dev script will build on a new M1 Chip Mac soon? I tried it, but saw a bunch of link errors:

"ld: symbol(s) not found for architecture arm64"

Read More...

I pulled latest SM nightly build on Thursday and again on Friday (11 & 12 March). Didn't note the version. Was using those via VNC. Also saw same crashes on the 3.5.2 MacOS DMG connecting remotely to SM. Don't have nightlies for local app.

Read More...

I am still seeing application crashes during imaging runs.  Both in the nightly build on the StellarMate device itself as well as the MacOS Stable 3.5.2.  Just empirically, it appears to be related to downloading and saving the huge files created by the ASI2600MC.  I can get it to crash pretty consistently if I generate a bunch of bias or flat frames without a decent delay between captures.  I've also seen crashes during imaging runs (guiding and tracking) on both the SM VNC as well as MacOS remote.

I've seen this kind of crash before - when switching to the summary tab:
(From one of the MacOS crash logs)

Exception Type:        EXC_BAD_ACCESS (SIGSEGV)
Exception Codes:       EXC_I386_GPFLT
Exception Note:        EXC_CORPSE_NOTIFY

Termination Signal:    Segmentation fault: 11
Termination Reason:    Namespace SIGNAL, Code 0xb
Terminating Process:   exc handler [9428]

Thread 0 Crashed:: Dispatch queue: com.apple.main-thread
0   org.qt-project.QtGui              0x000000010fe37b24 QPixmap::cacheKey() const + 4
1   org.qt-project.QtWidgets          0x000000010f915ce5 QLabel::setPixmap(QPixmap const&) + 37
2                                     0x000000010d272eaf 0x10c991000 + 9313967
3   org.qt-project.QtWidgets          0x000000010f81f41c QWidget::event(QEvent*) + 1132
4   org.qt-project.QtWidgets          0x000000010f8c64ab QFrame::event(QEvent*) + 43
5   org.qt-project.QtCore             0x0000000110546558 QCoreApplicationPrivate::sendThroughObjectEventFilters(QObject*, QEvent*) + 248
6   org.qt-project.QtWidgets          0x000000010f7e5ea1 QApplicationPrivate::notify_helper(QObject*, QEvent*) + 241
7   org.qt-project.QtWidgets          0x000000010f7e7262 QApplication::notify(QObject*, QEvent*) + 466
8   org.qt-project.QtCore             0x0000000110546286 QCoreApplication::notifyInternal2(QObject*, QEvent*) + 166
9   org.qt-project.QtWidgets          0x000000010f81866e QWidgetPrivate::sendPendingMoveAndResizeEvents(bool, bool) + 270


Read More...